Bonjour,
J’ai installé le plugin mais les dépendances ne s’installent pas même après plusieurs tentatives.
J’ai un message d’erreur m’indiquant que l’installation a dépassé 60 minutes mais ce n’est absolument pas le cas.
Je suis sur Odroid C4 en Debian 11 Jeedom 4.4.6
Bonjour,
Peux tu fournir les logs d’installation du plugin ? et une capture d’écran de la page santé de ton Jeedom ?
Car sans plus d’infos, nous allons avoir du mal à avancer ![]()
Bonne journée,
TiTidom.
Bonjour,
Voici la santé:
le NOK c’est le plugin TTScat.
log TTSCat:
[2024-06-02 09:20:04][ERROR] : Attention : l'installation des dépendances a dépassé le temps maximum autorisé : 60min
le log TTSCat update
[2024-06-03 18:30:06] **********************
[2024-06-03 18:30:06] * Check Script Params *
[2024-06-03 18:30:06] **********************
[2024-06-03 18:30:06] ** Force System Updates :: NO **
[2024-06-03 18:30:06] ** Force Reinit PyEnv :: NO **
[2024-06-03 18:30:06] ** Force Reinit Venv :: NO **
[2024-06-03 18:30:06] *******************
[2024-06-03 18:30:06] * Check PyEnv Dir *
[2024-06-03 18:30:06] *******************
[2024-06-03 18:30:06] ** PyEnv Directory (Exists) :: /opt/pyenv **
[2024-06-03 18:30:06] ** Check PyEnv :: Done **
[2024-06-03 18:30:06] ***********************
[2024-06-03 18:30:06] * Check Old PyEnv Dir *
[2024-06-03 18:30:06] ***********************
[2024-06-03 18:30:06] ** PyEnv Old Directory (None) :: /var/www/html/plugins/ttscast/resources/pyenv **
[2024-06-03 18:30:06] ** Venv Update :: Not Needed **
[2024-06-03 18:30:06] ** Check Old PyEnv :: Done **
[2024-06-03 18:30:06] ******************
[2024-06-03 18:30:06] * Update apt-get *
[2024-06-03 18:30:06] ******************
[2024-06-03 18:30:06] ** Clean apt-get :: Done **
[2024-06-03 18:30:07] Hit:1 http://deb.debian.org/debian bullseye InRelease
[2024-06-03 18:30:07] Hit:2 http://security.debian.org bullseye-security InRelease
[2024-06-03 18:30:07] Hit:3 http://deb.debian.org/debian bullseye-updates InRelease
[2024-06-03 18:30:07] Hit:4 http://deb.debian.org/debian bullseye-backports InRelease
[2024-06-03 18:30:07] Hit:5 https://deb.nodesource.com/node_18.x nodistro InRelease
[2024-06-03 18:30:07] Hit:6 http://mirrors.xtom.de/armbian bullseye InRelease
[2024-06-03 18:30:13] Reading package lists...
[2024-06-03 18:30:13] ** Update apt-get :: Done **
[2024-06-03 18:30:13] ****************************
[2024-06-03 18:30:13] * Simulate apt-get upgrade *
[2024-06-03 18:30:13] ****************************
[2024-06-03 18:30:13] Reading package lists...
[2024-06-03 18:30:14] Building dependency tree...
[2024-06-03 18:30:14] Reading state information...
[2024-06-03 18:30:15] Calculating upgrade...
[2024-06-03 18:30:16] The following packages have been kept back:
[2024-06-03 18:30:16] armbian-bsp-cli-odroidc4 (23.02.2 => 24.5.1)
[2024-06-03 18:30:16] linux-dtb-current-meson64 (23.02.2 => 24.5.1)
[2024-06-03 18:30:16] linux-image-current-meson64 (23.02.2 => 24.5.1)
[2024-06-03 18:30:16] linux-u-boot-odroidc4-current (23.02.2 => 24.5.1)
[2024-06-03 18:30:16] The following packages will be upgraded:
[2024-06-03 18:30:16] apache2 (2.4.56-1~deb11u2 => 2.4.59-1~deb11u1)
[2024-06-03 18:30:16] apache2-bin (2.4.56-1~deb11u2 => 2.4.59-1~deb11u1)
[2024-06-03 18:30:16] apache2-data (2.4.56-1~deb11u2 => 2.4.59-1~deb11u1)
[2024-06-03 18:30:16] apache2-utils (2.4.56-1~deb11u2 => 2.4.59-1~deb11u1)
[2024-06-03 18:30:16] armbian-config (23.02.2 => 24.5.1)
[2024-06-03 18:30:16] armbian-firmware (23.02.2 => 24.5.1)
[2024-06-03 18:30:16] armbian-plymouth-theme (23.02.2 => 24.5.1)
[2024-06-03 18:30:16] armbian-zsh (23.02.2 => 24.5.1)
[2024-06-03 18:30:16] bsdextrautils (2.36.1-8+deb11u1 => 2.36.1-8+deb11u2)
[2024-06-03 18:30:16] bsdutils (1:2.36.1-8+deb11u1 => 1:2.36.1-8+deb11u2)
[2024-06-03 18:30:16] fdisk (2.36.1-8+deb11u1 => 2.36.1-8+deb11u2)
[2024-06-03 18:30:16] less (551-2 => 551-2+deb11u2)
[2024-06-03 18:30:16] libapache2-mod-php7.4 (7.4.33-1+deb11u4 => 7.4.33-1+deb11u5)
[2024-06-03 18:30:16] libblkid1 (2.36.1-8+deb11u1 => 2.36.1-8+deb11u2)
[2024-06-03 18:30:16] libc-bin (2.31-13+deb11u8 => 2.31-13+deb11u10)
[2024-06-03 18:30:16] libc-dev-bin (2.31-13+deb11u8 => 2.31-13+deb11u10)
[2024-06-03 18:30:17] libc-l10n (2.31-13+deb11u8 => 2.31-13+deb11u10)
[2024-06-03 18:30:17] libc6 (2.31-13+deb11u8 => 2.31-13+deb11u10)
[2024-06-03 18:30:17] libc6-dev (2.31-13+deb11u8 => 2.31-13+deb11u10)
[2024-06-03 18:30:17] libdav1d4 (0.7.1-3 => 0.7.1-3+deb11u1)
[2024-06-03 18:30:17] libfdisk1 (2.36.1-8+deb11u1 => 2.36.1-8+deb11u2)
[2024-06-03 18:30:17] libglib2.0-0 (2.66.8-1+deb11u1 => 2.66.8-1+deb11u3)
[2024-06-03 18:30:17] libgstreamer-plugins-base1.0-0 (1.18.4-2+deb11u1 => 1.18.4-2+deb11u2)
[2024-06-03 18:30:17] libmount1 (2.36.1-8+deb11u1 => 2.36.1-8+deb11u2)
[2024-06-03 18:30:17] libsmartcols1 (2.36.1-8+deb11u1 => 2.36.1-8+deb11u2)
[2024-06-03 18:30:17] locales (2.31-13+deb11u8 => 2.31-13+deb11u10)
[2024-06-03 18:30:17] mount (2.36.1-8+deb11u1 => 2.36.1-8+deb11u2)
[2024-06-03 18:30:17] nodejs (18.19.1-1nodesource1 => 18.20.3-1nodesource1)
[2024-06-03 18:30:17] php7.4 (7.4.33-1+deb11u4 => 7.4.33-1+deb11u5)
[2024-06-03 18:30:17] php7.4-cli (7.4.33-1+deb11u4 => 7.4.33-1+deb11u5)
[2024-06-03 18:30:17] php7.4-common (7.4.33-1+deb11u4 => 7.4.33-1+deb11u5)
[2024-06-03 18:30:17] php7.4-curl (7.4.33-1+deb11u4 => 7.4.33-1+deb11u5)
[2024-06-03 18:30:17] php7.4-dev (7.4.33-1+deb11u4 => 7.4.33-1+deb11u5)
[2024-06-03 18:30:17] php7.4-gd (7.4.33-1+deb11u4 => 7.4.33-1+deb11u5)
[2024-06-03 18:30:17] php7.4-imap (7.4.33-1+deb11u4 => 7.4.33-1+deb11u5)
[2024-06-03 18:30:17] php7.4-json (7.4.33-1+deb11u4 => 7.4.33-1+deb11u5)
[2024-06-03 18:30:17] php7.4-ldap (7.4.33-1+deb11u4 => 7.4.33-1+deb11u5)
[2024-06-03 18:30:17] php7.4-mbstring (7.4.33-1+deb11u4 => 7.4.33-1+deb11u5)
[2024-06-03 18:30:17] php7.4-mysql (7.4.33-1+deb11u4 => 7.4.33-1+deb11u5)
[2024-06-03 18:30:17] php7.4-opcache (7.4.33-1+deb11u4 => 7.4.33-1+deb11u5)
[2024-06-03 18:30:17] php7.4-readline (7.4.33-1+deb11u4 => 7.4.33-1+deb11u5)
[2024-06-03 18:30:17] php7.4-snmp (7.4.33-1+deb11u4 => 7.4.33-1+deb11u5)
[2024-06-03 18:30:17] php7.4-soap (7.4.33-1+deb11u4 => 7.4.33-1+deb11u5)
[2024-06-03 18:30:17] php7.4-xml (7.4.33-1+deb11u4 => 7.4.33-1+deb11u5)
[2024-06-03 18:30:17] php7.4-xmlrpc (7.4.33-1+deb11u4 => 7.4.33-1+deb11u5)
[2024-06-03 18:30:17] php7.4-zip (7.4.33-1+deb11u4 => 7.4.33-1+deb11u5)
[2024-06-03 18:30:17] rfkill (2.36.1-8+deb11u1 => 2.36.1-8+deb11u2)
[2024-06-03 18:30:17] util-linux (2.36.1-8+deb11u1 => 2.36.1-8+deb11u2)
[2024-06-03 18:30:17] xserver-common (2:1.20.11-1+deb11u11 => 2:1.20.11-1+deb11u13)
[2024-06-03 18:30:17] xvfb (2:1.20.11-1+deb11u11 => 2:1.20.11-1+deb11u13)
[2024-06-03 18:30:19] 50 upgraded, 0 newly installed, 0 to remove and 4 not upgraded.
[2024-06-03 18:30:19] Inst bsdutils [1:2.36.1-8+deb11u1] (1:2.36.1-8+deb11u2 Debian-Security:11/oldstable-security [arm64])
[2024-06-03 18:30:19] Conf bsdutils (1:2.36.1-8+deb11u2 Debian-Security:11/oldstable-security [arm64])
[2024-06-03 18:30:19] Inst libc6-dev [2.31-13+deb11u8] (2.31-13+deb11u10 Debian-Security:11/oldstable-security [arm64]) []
[2024-06-03 18:30:19] Inst libc-dev-bin [2.31-13+deb11u8] (2.31-13+deb11u10 Debian-Security:11/oldstable-security [arm64]) []
[2024-06-03 18:30:20] Inst libc6 [2.31-13+deb11u8] (2.31-13+deb11u10 Debian-Security:11/oldstable-security [arm64])
[2024-06-03 18:30:20] Conf libc6 (2.31-13+deb11u10 Debian-Security:11/oldstable-security [arm64])
[2024-06-03 18:30:20] Inst libblkid1 [2.36.1-8+deb11u1] (2.36.1-8+deb11u2 Debian-Security:11/oldstable-security [arm64])
[2024-06-03 18:30:20] Conf libblkid1 (2.36.1-8+deb11u2 Debian-Security:11/oldstable-security [arm64])
[2024-06-03 18:30:20] Inst libfdisk1 [2.36.1-8+deb11u1] (2.36.1-8+deb11u2 Debian-Security:11/oldstable-security [arm64])
[2024-06-03 18:30:20] Inst libmount1 [2.36.1-8+deb11u1] (2.36.1-8+deb11u2 Debian-Security:11/oldstable-security [arm64])
[2024-06-03 18:30:20] Conf libmount1 (2.36.1-8+deb11u2 Debian-Security:11/oldstable-security [arm64])
[2024-06-03 18:30:20] Inst libsmartcols1 [2.36.1-8+deb11u1] (2.36.1-8+deb11u2 Debian-Security:11/oldstable-security [arm64])
[2024-06-03 18:30:20] Conf libsmartcols1 (2.36.1-8+deb11u2 Debian-Security:11/oldstable-security [arm64])
[2024-06-03 18:30:20] Inst fdisk [2.36.1-8+deb11u1] (2.36.1-8+deb11u2 Debian-Security:11/oldstable-security [arm64])
[2024-06-03 18:30:20] Inst util-linux [2.36.1-8+deb11u1] (2.36.1-8+deb11u2 Debian-Security:11/oldstable-security [arm64])
[2024-06-03 18:30:20] Conf util-linux (2.36.1-8+deb11u2 Debian-Security:11/oldstable-security [arm64])
[2024-06-03 18:30:20] Inst libc-bin [2.31-13+deb11u8] (2.31-13+deb11u10 Debian-Security:11/oldstable-security [arm64])
[2024-06-03 18:30:20] Conf libc-bin (2.31-13+deb11u10 Debian-Security:11/oldstable-security [arm64])
[2024-06-03 18:30:20] Inst mount [2.36.1-8+deb11u1] (2.36.1-8+deb11u2 Debian-Security:11/oldstable-security [arm64])
[2024-06-03 18:30:20] Inst apache2 [2.4.56-1~deb11u2] (2.4.59-1~deb11u1 Debian-Security:11/oldstable-security [arm64]) []
[2024-06-03 18:30:20] Inst apache2-bin [2.4.56-1~deb11u2] (2.4.59-1~deb11u1 Debian-Security:11/oldstable-security [arm64]) []
[2024-06-03 18:30:20] Inst apache2-data [2.4.56-1~deb11u2] (2.4.59-1~deb11u1 Debian-Security:11/oldstable-security [all]) []
[2024-06-03 18:30:20] Inst apache2-utils [2.4.56-1~deb11u2] (2.4.59-1~deb11u1 Debian-Security:11/oldstable-security [arm64])
[2024-06-03 18:30:20] Inst bsdextrautils [2.36.1-8+deb11u1] (2.36.1-8+deb11u2 Debian-Security:11/oldstable-security [arm64])
[2024-06-03 18:30:20] Inst less [551-2] (551-2+deb11u2 Debian-Security:11/oldstable-security [arm64])
[2024-06-03 18:30:21] Inst libc-l10n [2.31-13+deb11u8] (2.31-13+deb11u10 Debian-Security:11/oldstable-security [all])
[2024-06-03 18:30:21] Inst locales [2.31-13+deb11u8] (2.31-13+deb11u10 Debian-Security:11/oldstable-security [all])
[2024-06-03 18:30:21] Inst armbian-config [23.02.2] (24.5.1 Armbian:bullseye [all])
[2024-06-03 18:30:21] Inst armbian-firmware [23.02.2] (24.5.1 Armbian:bullseye [all])
[2024-06-03 18:30:21] Inst armbian-plymouth-theme [23.02.2] (24.5.1 Armbian:bullseye [all])
[2024-06-03 18:30:21] Inst armbian-zsh [23.02.2] (24.5.1 Armbian:bullseye [all])
[2024-06-03 18:30:21] Inst php7.4-zip [7.4.33-1+deb11u4] (7.4.33-1+deb11u5 Debian-Security:11/oldstable-security [arm64]) []
[2024-06-03 18:30:21] Inst php7.4-xmlrpc [7.4.33-1+deb11u4] (7.4.33-1+deb11u5 Debian-Security:11/oldstable-security [arm64]) []
[2024-06-03 18:30:21] Inst php7.4-xml [7.4.33-1+deb11u4] (7.4.33-1+deb11u5 Debian-Security:11/oldstable-security [arm64]) []
[2024-06-03 18:30:21] Inst php7.4-soap [7.4.33-1+deb11u4] (7.4.33-1+deb11u5 Debian-Security:11/oldstable-security [arm64]) []
[2024-06-03 18:30:21] Inst php7.4-snmp [7.4.33-1+deb11u4] (7.4.33-1+deb11u5 Debian-Security:11/oldstable-security [arm64]) []
[2024-06-03 18:30:21] Inst php7.4-readline [7.4.33-1+deb11u4] (7.4.33-1+deb11u5 Debian-Security:11/oldstable-security [arm64]) []
[2024-06-03 18:30:22] Inst php7.4-opcache [7.4.33-1+deb11u4] (7.4.33-1+deb11u5 Debian-Security:11/oldstable-security [arm64]) []
[2024-06-03 18:30:22] Inst php7.4-mysql [7.4.33-1+deb11u4] (7.4.33-1+deb11u5 Debian-Security:11/oldstable-security [arm64]) []
[2024-06-03 18:30:22] Inst php7.4-mbstring [7.4.33-1+deb11u4] (7.4.33-1+deb11u5 Debian-Security:11/oldstable-security [arm64]) []
[2024-06-03 18:30:22] Inst php7.4-ldap [7.4.33-1+deb11u4] (7.4.33-1+deb11u5 Debian-Security:11/oldstable-security [arm64]) []
[2024-06-03 18:30:22] Inst php7.4-json [7.4.33-1+deb11u4] (7.4.33-1+deb11u5 Debian-Security:11/oldstable-security [arm64]) []
[2024-06-03 18:30:22] Inst php7.4-imap [7.4.33-1+deb11u4] (7.4.33-1+deb11u5 Debian-Security:11/oldstable-security [arm64]) []
[2024-06-03 18:30:22] Inst php7.4-gd [7.4.33-1+deb11u4] (7.4.33-1+deb11u5 Debian-Security:11/oldstable-security [arm64]) []
[2024-06-03 18:30:22] Inst php7.4-dev [7.4.33-1+deb11u4] (7.4.33-1+deb11u5 Debian-Security:11/oldstable-security [arm64]) []
[2024-06-03 18:30:22] Inst php7.4-curl [7.4.33-1+deb11u4] (7.4.33-1+deb11u5 Debian-Security:11/oldstable-security [arm64]) []
[2024-06-03 18:30:22] Inst libapache2-mod-php7.4 [7.4.33-1+deb11u4] (7.4.33-1+deb11u5 Debian-Security:11/oldstable-security [arm64]) []
[2024-06-03 18:30:23] Inst php7.4-cli [7.4.33-1+deb11u4] (7.4.33-1+deb11u5 Debian-Security:11/oldstable-security [arm64]) []
[2024-06-03 18:30:23] Inst php7.4-common [7.4.33-1+deb11u4] (7.4.33-1+deb11u5 Debian-Security:11/oldstable-security [arm64])
[2024-06-03 18:30:23] Inst libdav1d4 [0.7.1-3] (0.7.1-3+deb11u1 Debian-Security:11/oldstable-security [arm64])
[2024-06-03 18:30:23] Inst libglib2.0-0 [2.66.8-1+deb11u1] (2.66.8-1+deb11u3 Debian-Security:11/oldstable-security [arm64])
[2024-06-03 18:30:23] Inst libgstreamer-plugins-base1.0-0 [1.18.4-2+deb11u1] (1.18.4-2+deb11u2 Debian-Security:11/oldstable-security [arm64])
[2024-06-03 18:30:23] Inst nodejs [18.19.1-1nodesource1] (18.20.3-1nodesource1 . nodistro:nodistro [arm64])
[2024-06-03 18:30:23] Inst php7.4 [7.4.33-1+deb11u4] (7.4.33-1+deb11u5 Debian-Security:11/oldstable-security [all])
[2024-06-03 18:30:23] Inst rfkill [2.36.1-8+deb11u1] (2.36.1-8+deb11u2 Debian-Security:11/oldstable-security [arm64])
[2024-06-03 18:30:23] Inst xserver-common [2:1.20.11-1+deb11u11] (2:1.20.11-1+deb11u13 Debian-Security:11/oldstable-security [all])
[2024-06-03 18:30:23] Inst xvfb [2:1.20.11-1+deb11u11] (2:1.20.11-1+deb11u13 Debian-Security:11/oldstable-security [arm64])
[2024-06-03 18:30:23] Conf libc6-dev (2.31-13+deb11u10 Debian-Security:11/oldstable-security [arm64])
[2024-06-03 18:30:23] Conf libc-dev-bin (2.31-13+deb11u10 Debian-Security:11/oldstable-security [arm64])
[2024-06-03 18:30:23] Conf libfdisk1 (2.36.1-8+deb11u2 Debian-Security:11/oldstable-security [arm64])
[2024-06-03 18:30:23] Conf fdisk (2.36.1-8+deb11u2 Debian-Security:11/oldstable-security [arm64])
[2024-06-03 18:30:23] Conf mount (2.36.1-8+deb11u2 Debian-Security:11/oldstable-security [arm64])
[2024-06-03 18:30:23] Conf apache2 (2.4.59-1~deb11u1 Debian-Security:11/oldstable-security [arm64])
[2024-06-03 18:30:23] Conf apache2-bin (2.4.59-1~deb11u1 Debian-Security:11/oldstable-security [arm64])
[2024-06-03 18:30:23] Conf apache2-data (2.4.59-1~deb11u1 Debian-Security:11/oldstable-security [all])
[2024-06-03 18:30:23] Conf apache2-utils (2.4.59-1~deb11u1 Debian-Security:11/oldstable-security [arm64])
[2024-06-03 18:30:23] Conf bsdextrautils (2.36.1-8+deb11u2 Debian-Security:11/oldstable-security [arm64])
[2024-06-03 18:30:23] Conf less (551-2+deb11u2 Debian-Security:11/oldstable-security [arm64])
[2024-06-03 18:30:23] Conf libc-l10n (2.31-13+deb11u10 Debian-Security:11/oldstable-security [all])
[2024-06-03 18:30:23] Conf locales (2.31-13+deb11u10 Debian-Security:11/oldstable-security [all])
[2024-06-03 18:30:23] Conf armbian-config (24.5.1 Armbian:bullseye [all])
[2024-06-03 18:30:23] Conf armbian-firmware (24.5.1 Armbian:bullseye [all])
[2024-06-03 18:30:23] Conf armbian-plymouth-theme (24.5.1 Armbian:bullseye [all])
[2024-06-03 18:30:23] Conf armbian-zsh (24.5.1 Armbian:bullseye [all])
[2024-06-03 18:30:23] Conf php7.4-zip (7.4.33-1+deb11u5 Debian-Security:11/oldstable-security [arm64])
[2024-06-03 18:30:23] Conf php7.4-xmlrpc (7.4.33-1+deb11u5 Debian-Security:11/oldstable-security [arm64])
[2024-06-03 18:30:23] Conf php7.4-xml (7.4.33-1+deb11u5 Debian-Security:11/oldstable-security [arm64])
[2024-06-03 18:30:23] Conf php7.4-soap (7.4.33-1+deb11u5 Debian-Security:11/oldstable-security [arm64])
[2024-06-03 18:30:23] Conf php7.4-snmp (7.4.33-1+deb11u5 Debian-Security:11/oldstable-security [arm64])
[2024-06-03 18:30:23] Conf php7.4-readline (7.4.33-1+deb11u5 Debian-Security:11/oldstable-security [arm64])
[2024-06-03 18:30:23] Conf php7.4-opcache (7.4.33-1+deb11u5 Debian-Security:11/oldstable-security [arm64])
[2024-06-03 18:30:23] Conf php7.4-mysql (7.4.33-1+deb11u5 Debian-Security:11/oldstable-security [arm64])
[2024-06-03 18:30:23] Conf php7.4-mbstring (7.4.33-1+deb11u5 Debian-Security:11/oldstable-security [arm64])
[2024-06-03 18:30:23] Conf php7.4-ldap (7.4.33-1+deb11u5 Debian-Security:11/oldstable-security [arm64])
[2024-06-03 18:30:23] Conf php7.4-json (7.4.33-1+deb11u5 Debian-Security:11/oldstable-security [arm64])
[2024-06-03 18:30:23] Conf php7.4-imap (7.4.33-1+deb11u5 Debian-Security:11/oldstable-security [arm64])
[2024-06-03 18:30:23] Conf php7.4-gd (7.4.33-1+deb11u5 Debian-Security:11/oldstable-security [arm64])
[2024-06-03 18:30:23] Conf php7.4-dev (7.4.33-1+deb11u5 Debian-Security:11/oldstable-security [arm64])
[2024-06-03 18:30:23] Conf php7.4-curl (7.4.33-1+deb11u5 Debian-Security:11/oldstable-security [arm64])
[2024-06-03 18:30:23] Conf libapache2-mod-php7.4 (7.4.33-1+deb11u5 Debian-Security:11/oldstable-security [arm64])
[2024-06-03 18:30:23] Conf php7.4-cli (7.4.33-1+deb11u5 Debian-Security:11/oldstable-security [arm64])
[2024-06-03 18:30:23] Conf php7.4-common (7.4.33-1+deb11u5 Debian-Security:11/oldstable-security [arm64])
[2024-06-03 18:30:23] Conf libdav1d4 (0.7.1-3+deb11u1 Debian-Security:11/oldstable-security [arm64])
[2024-06-03 18:30:23] Conf libglib2.0-0 (2.66.8-1+deb11u3 Debian-Security:11/oldstable-security [arm64])
[2024-06-03 18:30:23] Conf libgstreamer-plugins-base1.0-0 (1.18.4-2+deb11u2 Debian-Security:11/oldstable-security [arm64])
[2024-06-03 18:30:23] Conf nodejs (18.20.3-1nodesource1 . nodistro:nodistro [arm64])
[2024-06-03 18:30:23] Conf php7.4 (7.4.33-1+deb11u5 Debian-Security:11/oldstable-security [all])
[2024-06-03 18:30:23] Conf rfkill (2.36.1-8+deb11u2 Debian-Security:11/oldstable-security [arm64])
[2024-06-03 18:30:23] Conf xserver-common (2:1.20.11-1+deb11u13 Debian-Security:11/oldstable-security [all])
[2024-06-03 18:30:23] Conf xvfb (2:1.20.11-1+deb11u13 Debian-Security:11/oldstable-security [arm64])
[2024-06-03 18:30:23] ** Upgrade Simulation :: Done **
[2024-06-03 18:30:23] ****************************************
[2024-06-03 18:30:23] * Install apt-get packages for Python3 *
[2024-06-03 18:30:23] ****************************************
[2024-06-03 18:30:23] Reading package lists...
[2024-06-03 18:30:24] Building dependency tree...
[2024-06-03 18:30:24] Reading state information...
[2024-06-03 18:30:27] python3-pip is already the newest version (20.3.4-4+deb11u1).
[2024-06-03 18:30:27] python3 is already the newest version (3.9.2-3).
[2024-06-03 18:30:27] python3-dev is already the newest version (3.9.2-3).
[2024-06-03 18:30:27] python3-venv is already the newest version (3.9.2-3).
[2024-06-03 18:30:27] python3-requests is already the newest version (2.25.1+dfsg-2).
[2024-06-03 18:30:27] python3-setuptools is already the newest version (52.0.0-4).
[2024-06-03 18:30:27] 0 upgraded, 0 newly installed, 0 to remove and 54 not upgraded.
[2024-06-03 18:30:27] ** Install packages for Python3 :: Done **
[2024-06-03 18:30:27] ***************************
[2024-06-03 18:30:27] * Check Python3.x Version *
[2024-06-03 18:30:27] ***************************
[2024-06-03 18:30:27] Python3.x Version :: 3.9
[2024-06-03 18:30:27] ** Check Python3 Version :: Done **
[2024-06-03 18:30:27] ******************************************************
[2024-06-03 18:30:27] * Install apt-get packages for PyEnv (Python < 3.11) *
[2024-06-03 18:30:27] ******************************************************
[2024-06-03 18:30:27] Reading package lists...
[2024-06-03 18:30:28] Building dependency tree...
[2024-06-03 18:30:28] Reading state information...
[2024-06-03 18:30:30] build-essential is already the newest version (12.9).
[2024-06-03 18:30:30] libbz2-dev is already the newest version (1.0.8-4).
[2024-06-03 18:30:30] curl is already the newest version (7.74.0-1.3+deb11u11).
[2024-06-03 18:30:30] git is already the newest version (1:2.30.2-1+deb11u2).
[2024-06-03 18:30:30] libffi-dev is already the newest version (3.3-6).
[2024-06-03 18:30:30] libxml2-dev is already the newest version (2.9.10+dfsg-6.7+deb11u4).
[2024-06-03 18:30:30] libncursesw5-dev is already the newest version (6.2+20201114-2+deb11u2).
[2024-06-03 18:30:30] libssl-dev is already the newest version (1.1.1w-0+deb11u1).
[2024-06-03 18:30:30] libreadline-dev is already the newest version (8.1-1).
[2024-06-03 18:30:30] libsqlite3-dev is already the newest version (3.34.1-3).
[2024-06-03 18:30:30] tk-dev is already the newest version (8.6.11+1).
[2024-06-03 18:30:30] libxmlsec1-dev is already the newest version (1.2.31-1).
[2024-06-03 18:30:30] liblzma-dev is already the newest version (5.2.5-2.1~deb11u1).
[2024-06-03 18:30:30] xz-utils is already the newest version (5.2.5-2.1~deb11u1).
[2024-06-03 18:30:30] zlib1g-dev is already the newest version (1:1.2.11.dfsg-2+deb11u2).
[2024-06-03 18:30:30] 0 upgraded, 0 newly installed, 0 to remove and 54 not upgraded.
[2024-06-03 18:30:30] ** Install packages for PyEnv :: Done **
[2024-06-03 18:30:30] *********************************
[2024-06-03 18:30:30] * Install PyEnv (Python < 3.11) *
[2024-06-03 18:30:30] *********************************
[2024-06-03 18:30:30] ** PYENV_ROOT (not set) :: OK **
[2024-06-03 18:30:30] e[2;32mUpdating /opt/pyenv...
From https://github.com/pyenv/pyenv
* branch master -> FETCH_HEAD
[2024-06-03 18:30:31] e[0mAlready up to date.
[2024-06-03 18:30:31] e[2;32mUpdating /opt/pyenv/plugins/pyenv-doctor...
From https://github.com/pyenv/pyenv-doctor
* branch master -> FETCH_HEAD
[2024-06-03 18:30:31] e[0mAlready up to date.
[2024-06-03 18:30:31] e[2;32mUpdating /opt/pyenv/plugins/pyenv-update...
From https://github.com/pyenv/pyenv-update
* branch master -> FETCH_HEAD
[2024-06-03 18:30:32] e[0mAlready up to date.
[2024-06-03 18:30:32] e[2;32mUpdating /opt/pyenv/plugins/pyenv-virtualenv...
From https://github.com/pyenv/pyenv-virtualenv
* branch master -> FETCH_HEAD
[2024-06-03 18:30:33] e[0mAlready up to date.
[2024-06-03 18:30:33] ** PyEnv Installation / Update / Cleaning :: Done **
[2024-06-03 18:30:33] **************************************************
[2024-06-03 18:30:33] * Compile and Install Python 3.11.9 (with PyEnv) *
[2024-06-03 18:30:33] **************************************************
[2024-06-03 18:30:33] * *
[2024-06-03 18:30:33] * ATTENTION : Cette phase de l'installation peut *
[2024-06-03 18:30:33] * être longue et durer de 2 minutes (Config ++) *
[2024-06-03 18:30:33] * à plus de 40 minutes sur des petites config ! *
[2024-06-03 18:30:33] **************************************************
[2024-06-03 18:30:33] ** Python 3.11.9 Installation :: Done **
[2024-06-03 18:30:33] **************************
[2024-06-03 18:30:33] * Create Python3.11 venv *
[2024-06-03 18:30:33] **************************
[2024-06-03 18:30:33] Python3 (Venv) Version :: None
[2024-06-03 18:30:33] Latest Python version installed with PyEnv :: 3.11.9
/var/www/html/plugins/ttscast/core/class/../../resources/install_apt.sh: line 205: /opt/pyenv/versions/3.11.9/bin/python3: No such file or directory
[2024-06-03 18:30:33] ** Create Python3.11 Venv :: Done **
[2024-06-03 18:30:33] *****************************
[2024-06-03 18:30:33] * Install Python3 libraries *
[2024-06-03 18:30:33] *****************************
/var/www/html/plugins/ttscast/core/class/../../resources/install_apt.sh: line 213: /var/www/html/plugins/ttscast/resources/venv/bin/python3: No such file or directory
[2024-06-03 18:30:33] ** Install Pip / Wheel :: Done **
/var/www/html/plugins/ttscast/core/class/../../resources/install_apt.sh: line 216: /var/www/html/plugins/ttscast/resources/venv/bin/python3: No such file or directory
[2024-06-03 18:30:33] ** Install Python3 librairies :: Done **
[2024-06-03 18:30:33] ****************************
[2024-06-03 18:30:33] * Set Owner on Directories *
[2024-06-03 18:30:33] ****************************
[2024-06-03 18:30:33] ** Set Owner for Venv Dir :: Done **
[2024-06-03 18:30:33] ****************
[2024-06-03 18:30:33] * Install DONE *
[2024-06-03 18:30:33] ****************
Bonne journée
Bonjour,
Humm… de ce que je vois dans les logs, tu as relancé plusieurs fois l’install des dépendances, et la 2ème fois que tu les as lancé, la précédente installation n’était pas terminée (ce qui est bizarre car sur un Ordoid C4, ca prend moins d’une heure.)
En tout cas, tu as plusieurs problèmes :
- ton système (OS, pas Jeedom) n’est pas à jour, et de ce que je vois dans les mises à jour en attente, il y en a qui sont nécessaires pour que les dépendances du plugin puissent aller au bout.
- l’install des dépendances a planté à un moment car lancé plusieurs fois, et maintenant que c’est corrompu, tu auras beau les relancer, cela ne fonctionnera pas sans d’autres actions correctrices.
donc commençons par les mises à jour du système, ensuite la réinstall de python :
Si et SEULEMENT SI tu souhaites le faire de manière automatisée via le plugin (je parle des mises à jour système), c’est possible. Mais encore une fois (comme dit dans la doc, dans le changelog et ici) : je ne saurais être tenu responsable si cela ne se passe pas bien (le risque ultime ? = que ton Jeedom ne soit plus accessible et le système corrompu.)
Bon, après ce rappel quelque peu alarmiste, mais nécessaire, j’ai testé cette fonction sur plusieurs systèmes, et cela s’est toujours très bien passé… ![]()
Donc si tu souhaites le faire, il faut procéder en plusieurs étapes :
1ère étape : faire les mises à jour système. Pour cela, dans la page de configuration du plugin TTSCast, tu coches la case « Force les mises à jour Systèmes » et tu cliques sur le bouton vert « Sauvegarder » à droite :
Une fois que tu as fait ca, tu relances l’installation des dépendances et tu suis l’installation en cliquant sur le bouton bleu « Ttscast_update », ca va t’afficher le déroulé, et surtout tu ne fais rien d’autre et tu attends que cela arrive au bout.
Une fois que les mises à jour sont passées, comme indiqué dans les logs d’install, il faut rebooter ton Jeedom.
Une fois rebooté, tu laisses ton Jeedom redémarrer tranquillement… et une fois que tout est démarré, tu retournes sur la page de configuration du plugin TTSCast.
2ème étape, tu vérifies que la case « Force les mises à jour systèmes » est bien décochée ! (important), et tu coches les cases « Force la réinitialisation de PyEnv » ET la 3ème case « Force la réinitialisation de Venv », et tu cliques ensuite sur le bouton vert « Sauvegarder » :
Là tu peux à nouveau relancer l’installation des dépendances et suivre via le bouton bleu « Ttscast_update ».
Tu attends bien surtout (même si tu as un message te disant que ca dure trop longtemps !) d’arriver au bout de l’installation des dépendances, avec ce message dans les logs :

Et là, tu nous dit si c’est mieux ? ![]()
TiTidom.
Bonjour,
La démarche est de faire un apt update et un apt upgrade.
Si oui, je peux le faire via Putty.
Il est vrai que ceux sont des commandes que je n’utilise pas (à tort
)
Bonjour @naif
Pour la première partie, oui c’est apt update / apt upgrade, tu peux en effet le faire de ton côté.
Par contre pour le reste, il faudra suivre ce que j’ai décris (pour réinstaller pyenv + python + venv) ![]()
TiTidom.
Bonjour
Mise à jour OS effectuée avec Putty (à l’avenir je le ferai régulièrement) !
suivi la phase 2, toutefois la relance des dépendances entraine l’installation en boucle !
Re,
Une bonne chose de faite ![]()
Je ne comprends pas lorsque tu dit « relance les dépendances entraine l’installation en boucle » ??? Tu as fait quoi exactement ?
Tu peux redonner les logs d’install ?
TiTidom.
J’ai bien ce message et aussitôt cela recommence à intaller
[2024-06-05 14:25:22] **********************
[2024-06-05 14:25:22] * Check Script Params *
[2024-06-05 14:25:22] **********************
[2024-06-05 14:25:22] ** Force System Updates :: NO **
[2024-06-05 14:25:22] ** Force Reinit PyEnv :: NO **
[2024-06-05 14:25:22] ** Force Reinit Venv :: NO **
[2024-06-05 14:25:22] *******************
[2024-06-05 14:25:22] * Check PyEnv Dir *
[2024-06-05 14:25:22] *******************
[2024-06-05 14:25:22] ** PyEnv Directory (Exists) :: /opt/pyenv **
[2024-06-05 14:25:22] ** Check PyEnv :: Done **
[2024-06-05 14:25:22] ***********************
[2024-06-05 14:25:22] * Check Old PyEnv Dir *
[2024-06-05 14:25:22] ***********************
[2024-06-05 14:25:22] ** PyEnv Old Directory (None) :: /var/www/html/plugins/ttscast/resources/pyenv **
[2024-06-05 14:25:22] ** Venv Update :: Not Needed **
[2024-06-05 14:25:22] ** Check Old PyEnv :: Done **
[2024-06-05 14:25:22] ******************
[2024-06-05 14:25:22] * Update apt-get *
[2024-06-05 14:25:22] ******************
[2024-06-05 14:25:22] ** Clean apt-get :: Done **
[2024-06-05 14:25:22] Hit:1 http://security.debian.org bullseye-security InRelease
[2024-06-05 14:25:22] Hit:2 http://deb.debian.org/debian bullseye InRelease
[2024-06-05 14:25:22] Hit:3 http://deb.debian.org/debian bullseye-updates InRelease
[2024-06-05 14:25:22] Hit:4 http://deb.debian.org/debian bullseye-backports InRelease
[2024-06-05 14:25:22] Hit:5 https://deb.nodesource.com/node_18.x nodistro InRelease
[2024-06-05 14:25:23] Hit:6 http://armbian.hosthatch.com/apt bullseye InRelease
[2024-06-05 14:25:29] Reading package lists...
[2024-06-05 14:25:29] ** Update apt-get :: Done **
[2024-06-05 14:25:29] ****************************
[2024-06-05 14:25:29] * Simulate apt-get upgrade *
[2024-06-05 14:25:29] ****************************
[2024-06-05 14:25:29] Reading package lists...
[2024-06-05 14:25:30] Building dependency tree...
[2024-06-05 14:25:30] Reading state information...
[2024-06-05 14:25:32] Calculating upgrade...
[2024-06-05 14:25:33] The following packages have been kept back:
[2024-06-05 14:25:33] armbian-bsp-cli-odroidc4 (23.02.2 => 24.5.1)
[2024-06-05 14:25:33] linux-dtb-current-meson64 (23.02.2 => 24.5.1)
[2024-06-05 14:25:33] linux-image-current-meson64 (23.02.2 => 24.5.1)
[2024-06-05 14:25:33] linux-u-boot-odroidc4-current (23.02.2 => 24.5.1)
[2024-06-05 14:25:33] 0 upgraded, 0 newly installed, 0 to remove and 4 not upgraded.
[2024-06-05 14:25:33] ** Upgrade Simulation :: Done **
[2024-06-05 14:25:33] ****************************************
[2024-06-05 14:25:33] * Install apt-get packages for Python3 *
[2024-06-05 14:25:33] ****************************************
[2024-06-05 14:25:33] Reading package lists...
[2024-06-05 14:25:34] Building dependency tree...
[2024-06-05 14:25:34] Reading state information...
[2024-06-05 14:25:36] python3-pip is already the newest version (20.3.4-4+deb11u1).
[2024-06-05 14:25:36] python3 is already the newest version (3.9.2-3).
[2024-06-05 14:25:36] python3-dev is already the newest version (3.9.2-3).
[2024-06-05 14:25:36] python3-venv is already the newest version (3.9.2-3).
[2024-06-05 14:25:36] python3-requests is already the newest version (2.25.1+dfsg-2).
[2024-06-05 14:25:36] python3-setuptools is already the newest version (52.0.0-4).
[2024-06-05 14:25:36] 0 upgraded, 0 newly installed, 0 to remove and 4 not upgraded.
[2024-06-05 14:25:36] ** Install packages for Python3 :: Done **
[2024-06-05 14:25:36] ***************************
[2024-06-05 14:25:36] * Check Python3.x Version *
[2024-06-05 14:25:36] ***************************
[2024-06-05 14:25:36] Python3.x Version :: 3.9
[2024-06-05 14:25:36] ** Check Python3 Version :: Done **
[2024-06-05 14:25:36] ******************************************************
[2024-06-05 14:25:36] * Install apt-get packages for PyEnv (Python < 3.11) *
[2024-06-05 14:25:36] ******************************************************
[2024-06-05 14:25:36] Reading package lists...
[2024-06-05 14:25:37] Building dependency tree...
[2024-06-05 14:25:37] Reading state information...
[2024-06-05 14:25:40] build-essential is already the newest version (12.9).
[2024-06-05 14:25:40] libbz2-dev is already the newest version (1.0.8-4).
[2024-06-05 14:25:40] curl is already the newest version (7.74.0-1.3+deb11u11).
[2024-06-05 14:25:40] git is already the newest version (1:2.30.2-1+deb11u2).
[2024-06-05 14:25:40] libffi-dev is already the newest version (3.3-6).
[2024-06-05 14:25:40] libxml2-dev is already the newest version (2.9.10+dfsg-6.7+deb11u4).
[2024-06-05 14:25:40] libncursesw5-dev is already the newest version (6.2+20201114-2+deb11u2).
[2024-06-05 14:25:40] libssl-dev is already the newest version (1.1.1w-0+deb11u1).
[2024-06-05 14:25:40] libreadline-dev is already the newest version (8.1-1).
[2024-06-05 14:25:40] libsqlite3-dev is already the newest version (3.34.1-3).
[2024-06-05 14:25:40] tk-dev is already the newest version (8.6.11+1).
[2024-06-05 14:25:40] libxmlsec1-dev is already the newest version (1.2.31-1).
[2024-06-05 14:25:40] liblzma-dev is already the newest version (5.2.5-2.1~deb11u1).
[2024-06-05 14:25:40] xz-utils is already the newest version (5.2.5-2.1~deb11u1).
[2024-06-05 14:25:40] zlib1g-dev is already the newest version (1:1.2.11.dfsg-2+deb11u2).
[2024-06-05 14:25:40] 0 upgraded, 0 newly installed, 0 to remove and 4 not upgraded.
[2024-06-05 14:25:40] ** Install packages for PyEnv :: Done **
[2024-06-05 14:25:40] *********************************
[2024-06-05 14:25:40] * Install PyEnv (Python < 3.11) *
[2024-06-05 14:25:40] *********************************
[2024-06-05 14:25:40] ** PYENV_ROOT (not set) :: OK **
[2024-06-05 14:25:40] e[2;32mUpdating /opt/pyenv...
From https://github.com/pyenv/pyenv
* branch master -> FETCH_HEAD
[2024-06-05 14:25:41] e[0mAlready up to date.
[2024-06-05 14:25:41] e[2;32mUpdating /opt/pyenv/plugins/pyenv-doctor...
From https://github.com/pyenv/pyenv-doctor
* branch master -> FETCH_HEAD
[2024-06-05 14:25:42] e[0mAlready up to date.
[2024-06-05 14:25:42] e[2;32mUpdating /opt/pyenv/plugins/pyenv-update...
From https://github.com/pyenv/pyenv-update
* branch master -> FETCH_HEAD
[2024-06-05 14:25:42] e[0mAlready up to date.
[2024-06-05 14:25:42] e[2;32mUpdating /opt/pyenv/plugins/pyenv-virtualenv...
From https://github.com/pyenv/pyenv-virtualenv
* branch master -> FETCH_HEAD
[2024-06-05 14:25:43] e[0mAlready up to date.
[2024-06-05 14:25:43] ** PyEnv Installation / Update / Cleaning :: Done **
[2024-06-05 14:25:43] **************************************************
[2024-06-05 14:25:43] * Compile and Install Python 3.11.9 (with PyEnv) *
[2024-06-05 14:25:43] **************************************************
[2024-06-05 14:25:43] * *
[2024-06-05 14:25:43] * ATTENTION : Cette phase de l'installation peut *
[2024-06-05 14:25:43] * être longue et durer de 2 minutes (Config ++) *
[2024-06-05 14:25:43] * à plus de 40 minutes sur des petites config ! *
[2024-06-05 14:25:43] **************************************************
Downloading Python-3.11.9.tar.xz...
-> https://www.python.org/ftp/python/3.11.9/Python-3.11.9.tar.xz
Installing Python-3.11.9...
Là de ce que je vois, il est en train d’installer Python 3.11.9 (jusque là c’est normal) : cette partie là dure combien de temps ?
J’avais demandé il me semble à un moment : tu as combien de place sur ton disque (ou carte SD) ?
Je demande cela pour m’assurer que tu as bien la place sur ton jeedom pour installer tout cela.
TiTidom.
sauf que cela fait le 3) fois que j’ai ce message et cette séquence jusqu’au message:
j’ai une emmc de 34 GO avec uniquement Debian 11 et Jeedom
ok, donc déjà il faut que tu arrives à prendre les logs avant qu’elles ne recommencent pour qu’on puisse voir tout le reste, jusq’au « Install Done ».
Il doit y avoir quelque chose qui ne fonctionne pas : pour je ne sais quelle raison, il n’installe pas Python, et donc tout le reste doit planter, et ensuite il recommence à installer le tout car ce qu’il teste ne répond pas à ce qu’il attend.
Maintenant il faut comprendre pourquoi ca plante sur l’install de Python.
J’ai supprimer le plugin et réinstaller le plugin.
J’ai coché les2 case du bas (pyenv et env)
voila le fichier ttscast_update:
[2024-06-05 16:20:04] **********************
[2024-06-05 16:20:04] * Check Script Params *
[2024-06-05 16:20:04] **********************
[2024-06-05 16:20:04] ** Force System Updates :: NO **
[2024-06-05 16:20:04] ** Force Reinit PyEnv :: YES **
[2024-06-05 16:20:04] ** Force Reinit Venv :: YES **
[2024-06-05 16:20:04] *******************
[2024-06-05 16:20:04] * Check PyEnv Dir *
[2024-06-05 16:20:04] *******************
[2024-06-05 16:20:04] ** PyEnv Directory (Exists) :: /opt/pyenv **
[2024-06-05 16:20:04] ** Check PyEnv :: Done **
[2024-06-05 16:20:04] ***********************
[2024-06-05 16:20:04] * Check Old PyEnv Dir *
[2024-06-05 16:20:04] ***********************
[2024-06-05 16:20:04] ** PyEnv Old Directory (None) :: /var/www/html/plugins/ttscast/resources/pyenv **
[2024-06-05 16:20:04] ** Venv Update :: Not Needed **
[2024-06-05 16:20:04] ** Check Old PyEnv :: Done **
[2024-06-05 16:20:04] ******************
[2024-06-05 16:20:04] * Update apt-get *
[2024-06-05 16:20:04] ******************
[2024-06-05 16:20:04] ** Clean apt-get :: Done **
[2024-06-05 16:20:05] Hit:1 http://deb.debian.org/debian bullseye InRelease
[2024-06-05 16:20:05] Hit:2 http://deb.debian.org/debian bullseye-updates InRelease
[2024-06-05 16:20:05] Hit:3 http://security.debian.org bullseye-security InRelease
[2024-06-05 16:20:05] Hit:4 http://deb.debian.org/debian bullseye-backports InRelease
[2024-06-05 16:20:05] Hit:5 https://deb.nodesource.com/node_18.x nodistro InRelease
[2024-06-05 16:20:05] Hit:6 http://mirrors.xtom.de/armbian bullseye InRelease
[2024-06-05 16:20:11] Reading package lists...
[2024-06-05 16:20:11] ** Update apt-get :: Done **
[2024-06-05 16:20:11] ****************************
[2024-06-05 16:20:11] * Simulate apt-get upgrade *
[2024-06-05 16:20:11] ****************************
[2024-06-05 16:20:11] Reading package lists...
[2024-06-05 16:20:12] Building dependency tree...
[2024-06-05 16:20:12] Reading state information...
[2024-06-05 16:20:13] Calculating upgrade...
[2024-06-05 16:20:14] The following packages have been kept back:
[2024-06-05 16:20:14] armbian-bsp-cli-odroidc4 (23.02.2 => 24.5.1)
[2024-06-05 16:20:14] linux-dtb-current-meson64 (23.02.2 => 24.5.1)
[2024-06-05 16:20:14] linux-image-current-meson64 (23.02.2 => 24.5.1)
[2024-06-05 16:20:14] linux-u-boot-odroidc4-current (23.02.2 => 24.5.1)
[2024-06-05 16:20:14] 0 upgraded, 0 newly installed, 0 to remove and 4 not upgraded.
[2024-06-05 16:20:14] ** Upgrade Simulation :: Done **
[2024-06-05 16:20:14] ****************************************
[2024-06-05 16:20:14] * Install apt-get packages for Python3 *
[2024-06-05 16:20:14] ****************************************
[2024-06-05 16:20:14] Reading package lists...
[2024-06-05 16:20:15] Building dependency tree...
[2024-06-05 16:20:15] Reading state information...
[2024-06-05 16:20:17] python3-pip is already the newest version (20.3.4-4+deb11u1).
[2024-06-05 16:20:17] python3 is already the newest version (3.9.2-3).
[2024-06-05 16:20:17] python3-dev is already the newest version (3.9.2-3).
[2024-06-05 16:20:17] python3-venv is already the newest version (3.9.2-3).
[2024-06-05 16:20:17] python3-requests is already the newest version (2.25.1+dfsg-2).
[2024-06-05 16:20:17] python3-setuptools is already the newest version (52.0.0-4).
[2024-06-05 16:20:17] 0 upgraded, 0 newly installed, 0 to remove and 4 not upgraded.
[2024-06-05 16:20:17] ** Install packages for Python3 :: Done **
[2024-06-05 16:20:17] ***************************
[2024-06-05 16:20:17] * Check Python3.x Version *
[2024-06-05 16:20:17] ***************************
[2024-06-05 16:20:17] Python3.x Version :: 3.9
[2024-06-05 16:20:17] ** Check Python3 Version :: Done **
[2024-06-05 16:20:17] ******************************************************
[2024-06-05 16:20:17] * Install apt-get packages for PyEnv (Python < 3.11) *
[2024-06-05 16:20:17] ******************************************************
[2024-06-05 16:20:17] Reading package lists...
[2024-06-05 16:20:18] Building dependency tree...
[2024-06-05 16:20:18] Reading state information...
[2024-06-05 16:20:20] build-essential is already the newest version (12.9).
[2024-06-05 16:20:20] libbz2-dev is already the newest version (1.0.8-4).
[2024-06-05 16:20:20] curl is already the newest version (7.74.0-1.3+deb11u11).
[2024-06-05 16:20:20] git is already the newest version (1:2.30.2-1+deb11u2).
[2024-06-05 16:20:20] libffi-dev is already the newest version (3.3-6).
[2024-06-05 16:20:20] libxml2-dev is already the newest version (2.9.10+dfsg-6.7+deb11u4).
[2024-06-05 16:20:20] libncursesw5-dev is already the newest version (6.2+20201114-2+deb11u2).
[2024-06-05 16:20:20] libssl-dev is already the newest version (1.1.1w-0+deb11u1).
[2024-06-05 16:20:20] libreadline-dev is already the newest version (8.1-1).
[2024-06-05 16:20:20] libsqlite3-dev is already the newest version (3.34.1-3).
[2024-06-05 16:20:20] tk-dev is already the newest version (8.6.11+1).
[2024-06-05 16:20:20] libxmlsec1-dev is already the newest version (1.2.31-1).
[2024-06-05 16:20:20] liblzma-dev is already the newest version (5.2.5-2.1~deb11u1).
[2024-06-05 16:20:20] xz-utils is already the newest version (5.2.5-2.1~deb11u1).
[2024-06-05 16:20:20] zlib1g-dev is already the newest version (1:1.2.11.dfsg-2+deb11u2).
[2024-06-05 16:20:20] 0 upgraded, 0 newly installed, 0 to remove and 4 not upgraded.
[2024-06-05 16:20:20] ** Install packages for PyEnv :: Done **
[2024-06-05 16:20:20] *********************************
[2024-06-05 16:20:20] * Install PyEnv (Python < 3.11) *
[2024-06-05 16:20:20] *********************************
[2024-06-05 16:20:20] ** PYENV_ROOT (not set) :: OK **
[2024-06-05 16:20:21] e[2;32mUpdating /opt/pyenv...
From https://github.com/pyenv/pyenv
* branch master -> FETCH_HEAD
[2024-06-05 16:20:22] e[0mAlready up to date.
[2024-06-05 16:20:22] e[2;32mUpdating /opt/pyenv/plugins/pyenv-doctor...
From https://github.com/pyenv/pyenv-doctor
* branch master -> FETCH_HEAD
[2024-06-05 16:20:23] e[0mAlready up to date.
[2024-06-05 16:20:23] e[2;32mUpdating /opt/pyenv/plugins/pyenv-update...
From https://github.com/pyenv/pyenv-update
* branch master -> FETCH_HEAD
[2024-06-05 16:20:24] e[0mAlready up to date.
[2024-06-05 16:20:24] e[2;32mUpdating /opt/pyenv/plugins/pyenv-virtualenv...
From https://github.com/pyenv/pyenv-virtualenv
* branch master -> FETCH_HEAD
[2024-06-05 16:20:24] e[0mAlready up to date.
[2024-06-05 16:20:25] ** PyEnv Cleaning :: /opt/pyenv/versions/3.11.9 :: Done **
[2024-06-05 16:20:25] ** PyEnv Installation / Update / Cleaning :: Done **
[2024-06-05 16:20:25] **************************************************
[2024-06-05 16:20:25] * Compile and Install Python 3.11.9 (with PyEnv) *
[2024-06-05 16:20:25] **************************************************
[2024-06-05 16:20:25] * *
[2024-06-05 16:20:25] * ATTENTION : Cette phase de l'installation peut *
[2024-06-05 16:20:25] * être longue et durer de 2 minutes (Config ++) *
[2024-06-05 16:20:25] * à plus de 40 minutes sur des petites config ! *
[2024-06-05 16:20:25] **************************************************
Downloading Python-3.11.9.tar.xz...
-> https://www.python.org/ftp/python/3.11.9/Python-3.11.9.tar.xz
Installing Python-3.11.9...
BUILD FAILED (Debian 11 using python-build 20180424)
Inspect or clean up the working tree at /tmp/python-build.20240605162025.57210
Results logged to /tmp/python-build.20240605162025.57210.log
Last 10 log lines:
gcc -pthread -c -Wsign-compare -DNDEBUG -g -fwrapv -O3 -Wall -std=c11 -Wextra -Wno-unused-parameter -Wno-missing-field-initializers -Werror=implicit-function-declaration -fvisibility=hidden -I./Include/internal -I. -I./Include -I/opt/pyenv/versions/3.11.9/include -I/opt/pyenv/versions/3.11.9/include -fPIC -DPy_BUILD_CORE -o Objects/tupleobject.o Objects/tupleobject.c
gcc -pthread -c -Wsign-compare -DNDEBUG -g -fwrapv -O3 -Wall -std=c11 -Wextra -Wno-unused-parameter -Wno-missing-field-initializers -Werror=implicit-function-declaration -fvisibility=hidden -I./Include/internal -I. -I./Include -I/opt/pyenv/versions/3.11.9/include -I/opt/pyenv/versions/3.11.9/include -fPIC -DPy_BUILD_CORE -o Objects/typeobject.o Objects/typeobject.c
gcc -pthread -c -Wsign-compare -DNDEBUG -g -fwrapv -O3 -Wall -std=c11 -Wextra -Wno-unused-parameter -Wno-missing-field-initializers -Werror=implicit-function-declaration -fvisibility=hidden -I./Include/internal -I. -I./Include -I/opt/pyenv/versions/3.11.9/include -I/opt/pyenv/versions/3.11.9/include -fPIC -DPy_BUILD_CORE -o Objects/unicodeobject.o Objects/unicodeobject.c
Objects/unicodeobject.c: In function ‘rsplit’:
gcc: internal compiler error: Segmentation fault signal terminated program cc1
Please submit a full bug report,
with preprocessed source if appropriate.
See <file:///usr/share/doc/gcc-10/README.Bugs> for instructions.
make: *** [Makefile:2521: Objects/unicodeobject.o] Error 4
make: *** Waiting for unfinished jobs....
[2024-06-05 16:23:31] ** Python 3.11.9 Installation :: Done **
[2024-06-05 16:23:31] **************************
[2024-06-05 16:23:31] * Create Python3.11 venv *
[2024-06-05 16:23:31] **************************
[2024-06-05 16:23:31] Python3 (Venv) Version :: None
[2024-06-05 16:23:31] Latest Python version installed with PyEnv ::
/var/www/html/plugins/ttscast/core/class/../../resources/install_apt.sh: line 205: /opt/pyenv/versions/3.11.9/bin/python3: No such file or directory
[2024-06-05 16:23:31] ** Create Python3.11 Venv :: Done **
[2024-06-05 16:23:31] *****************************
[2024-06-05 16:23:31] * Install Python3 libraries *
[2024-06-05 16:23:31] *****************************
/var/www/html/plugins/ttscast/core/class/../../resources/install_apt.sh: line 213: /var/www/html/plugins/ttscast/resources/venv/bin/python3: No such file or directory
[2024-06-05 16:23:31] ** Install Pip / Wheel :: Done **
/var/www/html/plugins/ttscast/core/class/../../resources/install_apt.sh: line 216: /var/www/html/plugins/ttscast/resources/venv/bin/python3: No such file or directory
[2024-06-05 16:23:31] ** Install Python3 librairies :: Done **
[2024-06-05 16:23:31] ****************************
[2024-06-05 16:23:31] * Set Owner on Directories *
[2024-06-05 16:23:31] ****************************
[2024-06-05 16:23:31] ** Set Owner for Venv Dir :: Done **
[2024-06-05 16:23:31] ****************
[2024-06-05 16:23:31] * Install DONE *
[2024-06-05 16:23:31] ****************
et les dépendances se relancent toutes seules
Bonsoir @naif,
On avance ![]()
Est ce que tu peux suivre ce qui est dit dans la log : aller supprimer le fichier / répertoire /tmp/python-build.20240605162025.57210 et retenter ?
Pour une raison que j’ignore (pour l’instant), l’installation de python plante, et si elle plante, comme je le pressentais, cela fait planter toute la suite
et cela explique aussi pourquoi il recommence en boucle (car Jeedom voit que les dépendances ne sont pas installées et donc les relance automatiquement, ce qui est normal, et ca replante, et ca se relance, etc…)
Tu as vérifié cette partie là ?
TiTidom.
espace disque disponible 75% de 34 GO
espace disque libre tmp 97 %
infos de santé
pour le tmp j’ai 2 fivhiers python-build (dont un « log »
mais si je les vois, je ne sais pas les supprimer ![]()
dans le fichier tmp/python…log
je lis deux lignes dans lesquelles il est écrit:
checking build system type…aarch64-unknow-linux-gnu
checking host system type…aarch64-unknow-linux-gnu
c’est peut être intéressant car c’est mon OS
tu peux le mettre en entier le fichier ?
Si tu as accès en putty à ton jeedom, tu peux taper cette commande pour supprimer ce fichier (ou répertoire) :
sudo rm -rf /tmp/python-build.20240605162025.57210
Connectes toi en putty sur ton jeedom, et tapes cette commande :
sudo cat /tmp/python-build.20240605162025.57210.log
et dans la fenêtre où tout s’affiche, tu remontes au début, et tu copies l’ensemble des logs (au format texte, pas en capture d’écran), et tu les colles ici dans les balises pré-formatées ![]()
TiTidom.
2 messages ont été scindés en un nouveau sujet : Error: importing module Google Cloud TTS :: /lib/arm-linux-gnueabihf/libstdc++.so.6: version `GLIBCXX_3.4.29’ not found



